{"text_format":"1","workbook":"xlsx","n_sheets":9,"sheets":["Dashboard","Charts","Ledger","Account","Transactions","Cashflow","Creditcard","Precoding","Settings"],"not_rendered":{"charts":1,"images":0,"macros":1,"external_links":0,"defined_names":56,"comments":0,"pivot_tables":0},"unopened":[],"bounds":{"document_bytes":16777216,"sheet_cells":100000,"rows_first":2000,"rows_last":500,"rows_between":2000,"halvings":0,"cell_chars":16384,"cell_head_chars":4096},"cells_cut":0,"cells_raw":0,"read":"whole","date_system":"1900"}

{"sheet":"Dashboard","index":0,"n_rows":44,"n_cols":16,"rows_kept":44,"cut":false,"hidden":false,"merged":[]}
[{"$f":"FinYear","v":2023},"Financial Dashboard",{"$f":"D37","v":0}]
[]
[null,"Transactions processed until",null,{"$f":"MAX(Transactions!E1:INDIRECT(ADDRESS(MaxTransactions,5,1,,\"Transactions\")))","v":"2023-02-28"},null,null,null,{"$f":"\"© 2014 - \" & FinYear & \" by Geldnerd\"","v":"© 2014 - 2023 by Geldnerd"},null,null,null,null,null,null,"2023-02-09"," < Last Bank import"]
[null,"Days processed in year",null,{"$f":"D3-DATE(FinYear,1,1)+1","v":59},{"$f":"D4/Ledger!C5","v":0.16164383561643836},null,null,null,null,null,null,null,null,null,"2023-02-09"," < Last Creditcard import"]
[]
[null,"Expenses",null,null,"Out",null,null,null,"In",null,null,null,"Income",null,{"$f":"CreditCardBalance(\"VISA\")","v":246.8}," < Creditcard Balance"]
[null,null,null,"Δ%","Budget","Actual",null,"Δ%","Budget","Actual"]
[]
[1000,"Huisvesting",null,{"$f":"IFERROR((F9/E9)-1, \"-\")","v":"-"},{"$f":"Ledger!E13","v":0},{"$f":"Ledger!C13","v":0},null,{"$f":"IFERROR((J9/I9)-1, \"-\")","v":3.0896690879741673E-2},{"$f":"Ledger!E149","v":9504.6575342465749},{"$f":"Ledger!C149","v":9798.32},null,100,"Salaris",null,"Accounts Balance"]
[1200,"Financiën en Zorg",null,{"$f":"IFERROR((F10/E10)-1, \"-\")","v":-0.46324179128634624},{"$f":"Ledger!E23","v":396.10013698630138},{"$f":"Ledger!C23","v":212.61},null,"-",{"$f":"Ledger!E150","v":0},{"$f":"Ledger!C150","v":0},null,110,"Belastingdienst"]
[1400,"Auto / Mobiliteit",null,-0.17514124293785305,{"$f":"Ledger!E34","v":121.23287671232876},{"$f":"Ledger!C34","v":100},null,"-",{"$f":"Ledger!E151","v":0},{"$f":"Ledger!C151","v":0},null,120,"Uitkeringen Verzekering",null,{"$f":"AccountBalance(P11,$D$3)","v":910.42999999999961},{"$f":"Settings!B26","v":"Lopende rekening Graai Bankiers"}]
[1600,"Telecom en Internet",null,0.53902874709205761,{"$f":"Ledger!E45","v":26.380273972602733},{"$f":"Ledger!C45","v":40.6},null,-1,{"$f":"Ledger!E152","v":32.328767123287669},{"$f":"Ledger!C152","v":0},null,130,"Websites",null,{"$f":"AccountBalance(P12,$D$3)","v":-225},{"$f":"Settings!B28","v":"Spaarrekening Graai Bankiers"}]
[1800,"Huishoudelijk en Voeding",null,-0.27745545415036943,{"$f":"Ledger!E53","v":315.20547945205482},{"$f":"Ledger!C53","v":227.75},null,"-",{"$f":"Ledger!E153","v":0},{"$f":"Ledger!C153","v":0},null,140,"Neveninkomsten",null,{"$f":"AccountBalance(P13,$D$3)","v":9964.56},{"$f":"Settings!B29","v":"Spaarrekening BufferBank"}]
[2000,"Abonnementen & Lidmaatschappen",null,0.78983496877787673,{"$f":"Ledger!E65","v":30.712328767123289},{"$f":"Ledger!C65","v":54.97},null,"-",{"$f":"Ledger!E154","v":0},{"$f":"Ledger!C154","v":0},null,150,"Giften",null,{"$f":"AccountBalance(P14,$D$3)","v":0},{"$f":"Settings!B27","v":"Contant geld"}]
[2200,"Inrichting en Electronica",null,-1,{"$f":"Ledger!E72","v":64.657534246575338},{"$f":"Ledger!C72","v":0},null,"-",{"$f":"Ledger!E155","v":0},{"$f":"Ledger!C155","v":0},null,160,"Verrekening Relatie - In - Vriendin"]
[5000,"Luxegoederen en -Diensten",null,2.0466646011785428,{"$f":"Ledger!E83","v":1127.4657534246576},{"$f":"Ledger!C83","v":3435.0099999999998},null,"-",{"$f":"Ledger!E156","v":0},{"$f":"Ledger!C156","v":0},null,170,"Verrekening Relatie - In - Geldnerd"]
[5500,"Hobby's",null,-1,{"$f":"Ledger!E96","v":80.821917808219183},{"$f":"Ledger!C96","v":0},null,{"$f":"IFERROR((J17/I17)-1, \"-\")","v":"-"},{"$f":"Ledger!E157","v":0},{"$f":"Ledger!C157","v":20},null,190,"Overig",null,"Payment Methods"]
[6000,"Reizen, Vakanties en Recreatie",null,-0.81908433236874745,{"$f":"Ledger!E102","v":331.36986301369865},{"$f":"Ledger!C102","v":59.95}]
[8000,"Kasgeld en Overige",null,7.7075184702303234E-2,{"$f":"Ledger!E110","v":2521.6438356164385},{"$f":"Ledger!C110","v":2716},null,null,null,{"$f":"(J26+J27)-(F26+F27)","v":0},null,null,"Saldo Declaraties",null,{"$f":"Ledger!J184","v":1},"kas - Contant Geld"]
[8500,"Reserve",null,"-",{"$f":"Ledger!E116","v":0},{"$f":"Ledger!C116","v":0},null,null,null,null,null,null,null,null,{"$f":"Ledger!J185","v":0},"ba - Betaalautomaat met pin"]
{"$rows_left_out":25}
{"sheet":"Charts","index":1,"n_rows":7,"n_cols":3,"rows_kept":7,"cut":false,"hidden":false,"merged":[]}
[]
[null,"Chart","No-Expense Days"]
[]
[null,"Start","2023-01-01"]
[null,"End","2023-02-28"]
[]
[null,"Account",905]

{"sheet":"Ledger","index":2,"n_rows":214,"n_cols":30,"rows_kept":214,"cut":false,"hidden":false,"merged":[]}
[{"$f":"FinYear","v":2023},"Financial Ledger"]
[]
[null,"Transactions processed until",{"$f":"Dashboard!D3","v":"2023-02-28"},null,null,null,null,"Cursief","Budget afkomstig uit sheet Cashflow"]
[null,"Days processed in year",{"$f":"C3-DATE(FinYear,1,1)+1","v":59},{"$f":"C4/C5","v":0.16164383561643836},null,75]
[null,"Number of days this year",{"$f":"DATE(FinYear,12,31)-DATE(FinYear,1,1)+1","v":365}]
[]
[null,null,null,null,null,"Actual vs","Actual vs"]
[null,null,"Actual","Budget","Budget","Budget","Budget",null,null,"Monthly",1,{"$f":"K8+1","v":2},{"$f":"L8+1","v":3},4,5,6,7,8,9,10,11,12]
["#","Ledger Account","YTD","Year","YTD","Year","YTD","Number","Remarks","Average","Januari","Februari","Maart","April","Mei","Juni","Juli","Augustus","September","Oktober","November","December","Total",null,null,null,"Q1","Q2","Q3","Q4"]
[]
[null,"Uitgaven"]
[]
[1000,"Huisvesting",{"$f":"SUM(C14:C21)","v":0},{"$f":"SUM(D14:D21)","v":0},0,0,0,0,null,{"$f":"MonthlyAverageV2($C$3,$C$4,$A13,TriggerField)","v":0},{"$f":"SUM(K14:K21)","v":0},0,0,0,0,0,0,0,0,0,0,0,{"$f":"SUM(K13:V13)","v":0},null,{"$f":"A13","v":1000},{"$f":"B13","v":"Huisvesting"},{"$f":"K13+L13+M13","v":0},{"$f":"N13+O13+P13","v":0},{"$f":"Q13+R13+S13","v":0},{"$f":"T13+U13+V13","v":0}]
[1010,"Hypotheekrente",{"$f":"-SUMIF(Transactions!$A$1:INDIRECT(ADDRESS(MaxTransactions,1,1,,\"Transactions\")),A14,Transactions!$H$1:INDIRECT(ADDRESS(MaxTransactions,8,1,,\"Transactions\")))","v":0},0,{"$f":"($C$4/$C$5)*D14","v":0},{"$f":"D14-C14","v":0},{"$f":"E14-C14","v":0},{"$f":"COUNTIF(Transactions!$A$1:INDIRECT(ADDRESS(MaxTransactions,1,1,,\"Transactions\")),A14)","v":0},null,{"$f":"MonthlyAverageV2($C$3,$C$4,$A14,TriggerField)","v":0},{"$f":"MonthlyBalance(K$8,$A14,TriggerField)","v":0},0,0,0,0,0,0,0,0,0,0,0,{"$f":"SUM(K14:V14)","v":0},null,1010,"Hypotheekrente",0,0,0,0]
[1020,"Servicekosten",{"$f":"-SUMIF(Transactions!$A$1:INDIRECT(ADDRESS(MaxTransactions,1,1,,\"Transactions\")),A15,Transactions!$H$1:INDIRECT(ADDRESS(MaxTransactions,8,1,,\"Transactions\")))","v":0},0,0,0,0,{"$f":"COUNTIF(Transactions!$A$1:INDIRECT(ADDRESS(MaxTransactions,1,1,,\"Transactions\")),A15)","v":0},null,{"$f":"MonthlyAverageV2($C$3,$C$4,$A15,TriggerField)","v":0},0,0,0,0,0,0,0,0,0,0,0,0,0,null,1020,"Servicekosten",0,0,0,0]
[1030,"Energie",{"$f":"-SUMIF(Transactions!$A$1:INDIRECT(ADDRESS(MaxTransactions,1,1,,\"Transactions\")),A16,Transactions!$H$1:INDIRECT(ADDRESS(MaxTransactions,8,1,,\"Transactions\")))","v":0},0,0,0,0,{"$f":"COUNTIF(Transactions!$A$1:INDIRECT(ADDRESS(MaxTransactions,1,1,,\"Transactions\")),A16)","v":0},null,{"$f":"MonthlyAverageV2($C$3,$C$4,$A16,TriggerField)","v":0},0,0,0,0,0,0,0,0,0,0,0,0,0,null,1030,"Energie",0,0,0,0]
[1040,"Water en Waterschap",{"$f":"-SUMIF(Transactions!$A$1:INDIRECT(ADDRESS(MaxTransactions,1,1,,\"Transactions\")),A17,Transactions!$H$1:INDIRECT(ADDRESS(MaxTransactions,8,1,,\"Transactions\")))","v":0},0,0,0,0,{"$f":"COUNTIF(Transactions!$A$1:INDIRECT(ADDRESS(MaxTransactions,1,1,,\"Transactions\")),A17)","v":0},null,{"$f":"MonthlyAverageV2($C$3,$C$4,$A17,TriggerField)","v":0},0,0,0,0,0,0,0,0,0,0,0,0,0,null,1040,"Water en Waterschap",0,0,0,0]
[1050,"Gemeente",{"$f":"-SUMIF(Transactions!$A$1:INDIRECT(ADDRESS(MaxTransactions,1,1,,\"Transactions\")),A18,Transactions!$H$1:INDIRECT(ADDRESS(MaxTransactions,8,1,,\"Transactions\")))","v":0},0,0,0,0,{"$f":"COUNTIF(Transactions!$A$1:INDIRECT(ADDRESS(MaxTransactions,1,1,,\"Transactions\")),A18)","v":0},null,{"$f":"MonthlyAverageV2($C$3,$C$4,$A18,TriggerField)","v":0},0,0,0,0,0,0,0,0,0,0,0,0,0,null,1050,"Gemeente",0,0,0,0]
[1060,"Huur Woonruimte",{"$f":"-SUMIF(Transactions!$A$1:INDIRECT(ADDRESS(MaxTransactions,1,1,,\"Transactions\")),A19,Transactions!$H$1:INDIRECT(ADDRESS(MaxTransactions,8,1,,\"Transactions\")))","v":0},0,0,0,0,{"$f":"COUNTIF(Transactions!$A$1:INDIRECT(ADDRESS(MaxTransactions,1,1,,\"Transactions\")),A19)","v":0},null,{"$f":"MonthlyAverageV2($C$3,$C$4,$A19,TriggerField)","v":0},0,0,0,0,0,0,0,0,0,0,0,0,0,null,1060,"Huur Woonruimte",0,0,0,0]
[1065,"Huur Opslagruimte",{"$f":"-SUMIF(Transactions!$A$1:INDIRECT(ADDRESS(MaxTransactions,1,1,,\"Transactions\")),A20,Transactions!$H$1:INDIRECT(ADDRESS(MaxTransactions,8,1,,\"Transactions\")))","v":0},0,0,0,0,{"$f":"COUNTIF(Transactions!$A$1:INDIRECT(ADDRESS(MaxTransactions,1,1,,\"Transactions\")),A20)","v":0},null,{"$f":"MonthlyAverageV2($C$3,$C$4,$A20,TriggerField)","v":0},0,0,0,0,0,0,0,0,0,0,0,0,0,null,1065,"Huur Opslagruimte",0,0,0,0]
{"$rows_left_out":195}
{"sheet":"Account","index":3,"n_rows":12,"n_cols":8,"rows_kept":12,"cut":false,"hidden":false,"merged":[]}
[{"$f":"FinYear","v":2023},"Account Details",null,null,null,"Actual vs","Actual vs"]
[null,null,"Actual","Budget","Budget","Budget","Budget"]
["#","Ledger Account","YTD","Year","YTD","Year","YTD","Number"]
[1810,"Supermarkt",12.379999999999999,200,32.328767123287669,187.62,19.94876712328767,4]
[]
[]
["Date","Description","Name","D/C","Type","Amount"]
[]
["2023-01-19","Betaalautomaat 13:36 pasnr. 1313    Apple Pay","Supermarkt AlBo","D","ap",-1.99]
["2023-01-20","Betaalautomaat 17:15 pasnr. 1313","Supermarkt JumBert","D","bc",-6.15]
["2023-01-22","Betaalautomaat 16:03 pasnr. 1313    Apple Pay","Supermarkt JumBert To Go","D","ap",-1.69]
["2023-02-28","Betaalautomaat 12:21 pasnr. 1313    Apple Pay","Supermarkt Jumbert Amsterdam","D","ap",-2.5499999999999998]

{"sheet":"Transactions","index":4,"n_rows":156,"n_cols":13,"rows_kept":156,"cut":false,"hidden":false,"merged":[]}
[5020,"Kas","EUR",null,"2023-01-30","2023-01-30","D",-10,null,null,"Horeca","kas","Kas / Outcome / 2023-01-30 21:47:04 +0000 / Borrel met Vuurvriendjes"]
[905,"NL99RABO0987654321","EUR",287,"2023-01-01","2023-01-01","C",0.39,1475.39,0,null,"db","Rente over periode                 01-01-2023 t/m 31-12-2023            "]
[9000,"NL99RABO0987654321","EUR",288,"2023-01-05","2023-01-05","D",-225.39,1250,"NL99RABO0123456789","G.E.L.D. Nerd","db","Afschrijving                          "]
[9000,"NL99RABO0987654321","EUR",289,"2023-01-18","2023-01-18","D",-250,1000,"NL99RABO0123456789","G.E.L.D. Nerd","db","Afschrijving                          "]
[9000,"NL99RABO0987654321","EUR",290,"2023-01-31","2023-01-31","D",-100,900,"NL99RABO0123456789","G.E.L.D. Nerd","db","Afschrijving                          "]
[9000,"NL99RABO0987654321","EUR",291,"2023-02-08","2023-02-08","D",-100,800,"NL99RABO0123456789","G.E.L.D. Nerd","db","Afschrijving                          "]
[9000,"NL99RABO0987654321","EUR",292,"2023-02-14","2023-02-14","D",-100,700,"NL99RABO0123456789","G.E.L.D. Nerd","db","Afschrijving                          "]
[9000,"NL99RABO0987654321","EUR",293,"2023-02-16","2023-02-16","D",-200,500,"NL99RABO0123456789","G.E.L.D. Nerd","db","Afschrijving                          "]
[0,"NL99RABO0123456789","EUR",5025,"2023-01-01","2023-01-01","D",-14.99,663.6,"NL71RABO0350808880","Grijpgraag Bankiers NV","cc","Kaartnummer: 9999.8888.7777.6666 Zie rekeningoverzicht 24-12-2023"]
[2020,"NL99RABO0123456789","EUR",5025,"2023-01-01","2023-01-01","D",-14.99,663.6,"NL71RABO0350808880","Grijpgraag Bankiers NV","cc","15-12-2023 / Spotify Premium Family"]
[1220,"NL99RABO0123456789","EUR",5026,"2023-01-02","2023-01-02","D",-26.77,636.83000000000004,"NL75RABO0101000731","KansOpClaim Verzekeringen NV","ei","PakketPolis 00013131313 PERIODE 01.01.2023 - 01.02.2023"]
[1870,"NL99RABO0123456789","EUR",5027,"2023-01-02","2023-01-02","D",-4.3899999999999997,632.44000000000005,null,"HoogVanDeTorenBlazen Kantoorcatering","ap","Betaalautomaat 13:05 pasnr. 1313    Apple Pay"]
[5020,"NL99RABO0123456789","EUR",5028,"2023-01-02","2023-01-02","D",-1.9,630.54,null,"Snackbar De Gelukkige Frikandel","bc","Betaalautomaat 15:22 pasnr. 1313"]
[1210,"NL99RABO0123456789","EUR",5029,"2023-01-03","2023-01-01","D",-4.8,625.74,null,"Kosten","db","Gijpgraag Bank Pakketje                  Periode 01-01-2023 t/m 31-01-2023"]
[190,"NL99RABO0123456789","EUR",5030,"2023-01-03","2023-01-03","C",10,635.74,"NL62INGB0663707048","Loterij Kansloos NV","cb","Gefeliciteerd, Gewonnen met Oudejaarstrekking, Trekking 31-12-2023, 60134258.29762"]
[5010,"NL99RABO0123456789","EUR",5031,"2023-01-05","2023-01-05","D",-69.97,565.77,null,"SpijkerbroekenShop Nederland Geldnerd City","ap","Betaalautomaat 13:39 pasnr. 1313    Apple Pay"]
[5010,"NL99RABO0123456789","EUR",5032,"2023-01-05","2023-01-06","D",-64.97,500.8,"NL20DEUT0509367593","FijneTruien BV","id","1421890430 1150001178045204 2x artikel(en) uit de FijneTruien BV e-s - x0000 pasnr. 1313"]
[5010,"NL99RABO0123456789","EUR",5033,"2023-01-05","2023-01-06","D",-393.3,107.5,"NL56DEUT0265186420","KledingOnline by Buckaroo","id","400086718 1030000143573170 KledingOnline Buckaroo x2537 pasnr. 1313"]
[900,"NL99RABO0123456789","EUR",5034,"2023-01-05","2023-01-05","C",225.39,332.89,"NL99RABO0987654321","G.E.L.D. Nerd","tb"," "]
[1450,"NL99RABO0123456789","EUR",5035,"2023-01-06","2023-01-06","D",-50,282.89,"NL12RABO0306498111","TLS BV inz. OV-Chipkaart","ei","Automatisch opladen OV-chipkaart Kaartnummer:9876987698769876 Oplaaddatum/tijd:01-01-20 16:51"]
{"$rows_left_out":137}
{"sheet":"Cashflow","index":5,"n_rows":45,"n_cols":18,"rows_kept":45,"cut":false,"hidden":false,"merged":[]}
["Cashflow"]
[]
[null,null,"Freq","Date","Jan","Feb","Maa","Apr","Mei","Jun","Jul","Aug","Sep","Okt","Nov","Dec","Total","Remarks"]
[]
[null,"Salaris",null,24,4900,{"$f":"E5","v":4900},4900,4900,4900,4900,4900,4900,4900,4900,4900,4900,{"$f":"SUM(E5:P5)","v":58800}]
[null,"Vakantiegeld / 13e maand / Bonus - oude stelsel",null,null,null,null,null,null,null,null,null,null,null,null,null,null,{"$f":"SUM(E6:P6)","v":0}]
[]
[null,"Besteedbaar Inkomen",null,null,{"$f":"SUM(E5:E7)","v":4900},4900,4900,4900,4900,4900,4900,4900,4900,4900,4900,4900,{"$f":"SUM(E8:P8)","v":58800}]
[]
[null,"Beleggen",null,null,1000,{"$f":"E10","v":1000},1000,1000,1000,1000,1000,1000,1000,1000,1000,1000,{"$f":"SUM(E10:P10)","v":12000}]
[null,"Sparen / Extra Aflossen",null,null,500,500,500,500,500,500,500,500,500,500,500,500,6000]
[null,"Reguliere Aflossing",null,null,400,400,400,400,400,400,400,400,400,400,400,400,4800]
[null,"Gezamenlijk Huishouden (incl. hypotheekrente)",null,null,1300,1300,1300,1300,1300,1300,1300,1300,1300,1300,1300,1300,15600]
[null,{"$f":"Ledger!B132","v":"Voorziening Zorgverzekering"},null,null,100,100,100,100,100,100,100,100,100,100,100,100,1200]
[null,{"$f":"Ledger!B133","v":"Voorziening Vakanties"},null,null,200,200,200,200,200,200,200,200,200,200,200,200,2400]
[null,{"$f":"Ledger!B134","v":"Voorziening Gezond Leven"},null,null,100,100,100,100,100,100,100,100,100,100,100,100,1200]
[null,{"$f":"Ledger!B135","v":"Voorziening Kleding"},null,null,200,200,200,200,200,200,200,200,200,200,200,200,2400]
[null,{"$f":"Ledger!B136","v":"Voorziening Gadgets / Tech"},null,null,100,{"$f":"E18","v":100},100,100,100,100,100,100,100,100,100,100,{"$f":"SUM(E18:P18)","v":1200}]
[null,{"$f":"Ledger!B137","v":"Voorziening Onderhoud Huis"},null,null,100,100,100,100,100,100,100,100,100,100,100,100,1200]
[null,{"$f":"Ledger!B138","v":"Voorziening Bril"},null,null,50,{"$f":"E20","v":50},{"$f":"F20","v":50},{"$f":"G20","v":50},{"$f":"H20","v":50},{"$f":"I20","v":50},{"$f":"J20","v":50},{"$f":"K20","v":50},{"$f":"L20","v":50},{"$f":"M20","v":50},{"$f":"N20","v":50},{"$f":"O20","v":50},600,"2015 - 2018 - 2021"]
{"$rows_left_out":26}
{"sheet":"Creditcard","index":6,"n_rows":3,"n_cols":5,"rows_kept":3,"cut":false,"hidden":false,"merged":[]}
["Account","Card","Date","EUR","Description"]
[5010,"VISA","2022-12-22",-149,"14000000001 / TeDureOverhemden.COM NLD"]
[5010,"VISA","2022-12-22",-97.8,"14000000002 / NogMeerKleding.NL NLD"]

{"sheet":"Precoding","index":7,"n_rows":35,"n_cols":13,"rows_kept":35,"cut":false,"hidden":false,"merged":[]}
[0,"NL99RABO0123456789","EUR",null,null,null,"D",null,null,"NL71RABO0350808880","Grijpgraag Bankiers NV","cc","Kaartnummer: 9999.8888.7777.6666 Zie rekeningoverzicht "]
[100,"NL99RABO0123456789","EUR",null,null,null,"C",null,null,"NL09INGB0705005461","LoonSlaaf Inc.","cb","LOON/SALARIS00000000/"]
[190,"NL99RABO0123456789","EUR",null,null,null,"C",null,null,"NL62INGB0663707048","Loterij Kansloos NV","cb","Gefeliciteerd, Gewonnen met Loterij Kansloos, Trekking"]
[1210,"NL99RABO0123456789","EUR",null,null,null,"D",null,null,null,"Kosten","db","Gijpgraag Bank Pakketje"]
[1220,"NL99RABO0123456789","EUR",null,null,null,"D",null,null,"NL75RABO0101000731","KansOpClaim Verzekeringen NV","ei","PakketPolis 00013131313 PERIODE"]
[1250,"NL99RABO0123456789","EUR",null,null,null,"D",null,null,null,"Tandartspraktijk Pijniger","ap","Betaalautomaat"]
[1450,"NL99RABO0123456789","EUR",null,null,null,"D",-50,null,"NL12RABO0306498111","TLS BV inz. OV-Chipkaart","ei","Automatisch opladen OV-chipkaart Kaartnummer:00001111222233334444 Oplaaddatum/tijd:"]
[1630,"NL99RABO0123456789","EUR",null,null,null,"D",-16,null,"NL93INGB0007939833","GeenVerbinding Telecom","ei","Klant Nr XXXXXX333/XXXXXX888"]
[1810,"NL99RABO0123456789","EUR",null,null,null,"D",null,null,null,"Supermarkt AlBo","ap","Betaalautomaat"]
[1810,"NL99RABO0123456789","EUR",null,null,null,"D",null,null,null,"Supermarkt JumBert","bc","Betaalautomaat"]
[1810,"NL99RABO0123456789","EUR",null,null,null,"D",null,null,null,"Supermarkt JumBert To Go","ap","Betaalautomaat"]
[1810,"NL99RABO0123456789","EUR",null,null,null,"D",null,null,null,"Supermarkt Jumbert Amsterdam","ap","Betaalautomaat"]
[1840,"NL99RABO0123456789","EUR",null,null,null,"D",null,null,null,"Bakkerij Het Verbrande Broodje","ap","Betaalautomaat"]
[1840,"NL99RABO0123456789","EUR",null,null,null,"D",null,null,null,"Slagerij De Drie Biggetjes","ap","Betaalautomaat"]
[1870,"NL99RABO0123456789","EUR",null,null,null,"D",null,null,null,"HoogVanDeTorenBlazen Kantoorcatering","ap","Betaalautomaat"]
[1870,"NL99RABO0123456789","EUR",null,null,null,"D",null,null,null,"Vetbak Kantoorcatering","ap","Betaalautomaat"]
[2020,"NL99RABO0123456789","EUR",null,null,null,"D",-14.99,null,"NL71RABO0350808880","Grijpgraag Bankiers NV","cc","Spotify Premium Family"]
[5020,"NL99RABO0123456789","EUR",null,null,null,"D",null,null,null,"HipsterKoffie Geldnerd City","ap","Betaalautomaat"]
[5020,"NL99RABO0123456789","EUR",null,null,null,"D",null,null,null,"Snackbar De Gelukkige Frikandel","ap","Betaalautomaat"]
[5020,"NL99RABO0123456789","EUR",null,null,null,"D",null,null,null,"Kiosk ASDZ 2614 AMSTERDAM","ap","Betaalautomaat"]
{"$rows_left_out":16}
{"sheet":"Settings","index":8,"n_rows":41,"n_cols":12,"rows_kept":41,"cut":false,"hidden":false,"merged":[]}
["Settings",null,null,null,null,null,null,null,null,null,"Fixed Settings - Do not edit!"]
[]
[null,"Default Bank","Rabobank",null,"Saving Rate Target (year)",0.45,null,null,null,null,"Banks","ABN AMRO"]
[null,"Default Creditcard","Rabobank",null,null,null,null,null,null,null,null,"ING"]
[null,null,null,null,null,null,null,null,null,null,null,"KNAB"]
[null,"Financial Year",2023,null,"Balance Check On",null,null,null,null,null,null,"Rabobank"]
[null,null,null,null,null,null,null,null,null,null,null,"SNS"]
[null,"Maximum number of transactions",1999]
[null,null,null,null,null,null,null,null,null,null,"Cards","ABN AMRO"]
[null,"Download directory","C:\\Users\\Geldnerd\\Downloads\\",null,null,null,null,null,null,null,null,"Rabobank"]
[null,"Archive Directory Rabobank","C:\\Users\\Geldnerd\\OneDrive\\Documenten\\Financials\\Downloads Rabobank\\2023\\"]
[null,"Archive Directory KNAB","C:\\Users\\Geldnerd\\OneDrive\\Documenten\\Financials\\Downloads KNAB\\"]
[null,"Archive Directory ING","C:\\Users\\Geldnerd\\OneDrive\\Documenten\\Financials\\Downloads ING\\",null,null,null,null,null,null,null,"SaldoCheck",true]
[null,"Archive Directory ABN AMRO","C:\\Users\\Geldnerd\\OneDrive\\Documenten\\Financials\\Downloads ABN AMRO\\2023\\"]
[null,"Archive Directory SNS","C:\\Users\\Geldnerd\\OneDrive\\Documenten\\Financials\\Downloads SNS\\"]
[null,"Archive Directory Lloyds","C:\\Users\\Geldnerd\\OneDrive\\Documenten\\Financials\\Downloads Lloyds\\2023\\",null,null,null,null,null,null,null,"Charts","Account per Month"]
[null,"Archive Directory Creditcards","C:\\Users\\Geldnerd\\OneDrive\\Documenten\\Financials\\Downloads Creditcards\\",null,null,null,null,null,null,null,null,"Current Account Balance"]
[null,"Filename","C:\\Users\\Geldnerd\\OneDrive\\Documenten\\Financials\\Financiele Administratie 2023.xlsm",null,null,null,null,null,null,null,null,"In/Out & Saving Rate"]
[null,null,null,null,null,null,null,null,null,null,null,"Lowest / Average Balance"]
[null,null,null,null,null,null,null,null,null,null,null,"Lowest Balance"]
{"$rows_left_out":21}